{"text_format":"1","workbook":"xlsx","n_sheets":3,"sheets":["SマニR仕様書","部品表","構成部品表"],"not_rendered":{"charts":0,"images":0,"macros":1,"external_links":1,"defined_names":63,"comments":0,"pivot_tables":0},"unopened":[],"bounds":{"document_bytes":16777216,"sheet_cells":100000,"rows_first":2000,"rows_last":500,"rows_between":2000,"halvings":0,"cell_chars":16384,"cell_head_chars":4096},"cells_cut":0,"cells_raw":0,"read":"whole","date_system":"1900"}

{"sheet":"SマニR仕様書","index":0,"n_rows":163,"n_cols":67,"rows_kept":163,"cut":false,"hidden":false,"merged":[[13,18,14,18],[13,19,17,26],[15,2,15,7],[16,2,17,7],[39,14,40,14],[32,2,35,7],[19,16,20,16],[19,14,20,14],[18,2,19,7],[23,2,26,8],[22,19,23,20],[22,21,23,26],[29,14,30,14],[34,14,35,14],[6,13,6,14],[65,2,65,7],[68,1,69,1],[54,14,55,14],[59,14,60,14],[49,14,50,14],[44,14,45,14],[22,9,23,9],[24,14,25,14],[20,2,22,8],[13,1,14,1],[6,2,6,5],[6,6,6,12],[7,2,7,5],[7,6,7,14],[9,12,9,14],[10,2,10,5],[10,18,10,26],[11,2,11,5],[11,18,11,26],[10,6,10,11],[11,6,11,11],[10,12,10,14],[11,12,11,14],[1,2,1,4],[4,1,5,1],[5,2,5,5],[5,6,5,14],[5,18,5,20],[6,18,6,25],[76,36,76,38],[26,21,27,23],[27,24,27,26],[29,24,29,26],[28,21,29,23],[18,19,20,26],[8,18,8,26],[22,18,23,18],[24,19,24,20],[24,21,24,26],[25,19,25,20],[25,21,25,26],[27,19,29,20],[9,18,9,26],[70,2,70,26],[7,16,7,17],[7,18,7,25],[8,2,8,5],[8,6,8,14],[9,6,9,11],[8,16,8,17],[9,2,9,5]]}
[]
[null,null,"購入仕様書",null,null,null,"スーパーマニホールド",null,null,null,null,null,"反転用",null,"(母管が右)",null,null,null,null,null,null,null,null,null,null,null,"株式会社リガルジョイント"]
[null,null,null,null,null,null,null,null,null,null,null,null,null,null,null,null,null,null,null,null,null,null,null,null,null,null,"TEL：042-756-7411"]
[null,"正しくご購入いただくために①~④を記入して下さい。",null,null,null,null,null,null,null,null,null,null,null,null,null,null,null,null,null,null,null,null,null,null,null,null,"FAX：042-752-2004"]
[null,"①","太枠内をご記入下さい。",null,null,null,null,null,null,null,"　　　*は必須項目"]
[null,null,"会社名　　*",null,null,null,null,null,null,null,null,null,null,null,null,null,"ご注文日　　　*",null,null,null,null,"年",null,null,"月",null,"日"]
[null,null,"貴社ご担当者 *",null,null,null,"　",null,null,null,null,null,null,"様　",null,null,"希望する総流量",null,null,null,null,null,null,null,null,null,"L/min"]
[null,null,"連絡先　　*",null,null,null,null,null,null,null,null,null,null,null,null,null,"供給圧力",null,null,null,null,null,null,null,null,null,"MPa"]
[null,null,"使用流体　*",null,null,null,null,null,null,null,null,null,null,null,null,null,"弊社記入欄"]
[null,null,"母管径　　*",null,null,null,"母管径を選択",null,null,null,null,null,"インチ",null,null,null,"担当"]
[null,null,"連数　　　*",null,null,null,"連数を選択",null,null,null,null,null,"連",null,null,null,"注文番号"]
[null,null,"数量　　　*",null,null,null,"数量を選択",null,null,null,null,null,"台",null,null,null,"管理番号"]
[]
[null,"②","番号順に一連ずつ使用部品を選んで下さい。(太枠内をクリックすると選択肢が出ます)",null,null,null,null,null,null,null,null,null,null,null,null,null,null,"　　","③","流量センサを搭載する場合、\nオレンジ枠内から入出力仕様を選んで下さい。\n(太枠内をクリックすると選択肢が出ます)"]
[null,null,"2-6■母管プラグ",null,null,null,null,null,null,null,null,null,null,null,null,null,"2-1■流量調整バルブ"]
[null,null,null,null,null,null,null,null,null,null,null,null,null,null,"選択"]
[null,null,"2-2■流路\n2-4■枝管アダプタ"]
[null,null,null,null,null,null,null,null,null,1,"口径と材質を選択",null,"搭載機器を選択",null,"流路",null,"流量調整バルブあり"]
[null,null,"2-3■搭載機器",null,null,null,null,null,null,null,null,null,null,null,null,null,null,null,null,"■センサ接液部のOリングはフッ素ゴムです。\n■ケーブル長は標準で500mmです。"]
[null,null,null,null,null,null,null,null,null,null,null,null,null,null,"選択",null,"　　"]
[null,null,"(流路を先に選んでください)\n\n2-5■連結部分"]
[]
[null,null,null,null,null,null,null,null,null,2,"口径と材質を選択",null,"搭載機器を選択",null,"流路",null,"有無を選択",null,null,"センサ\n型式",null,"選択"]
[null,null,"空欄：流体を流す\n  × ：流体を流さない"]
[null,null,null,null,null,null,null,null,null,null,null,null,null,null,"選択",null,null,null,null,"出力",null,"出力を選択"]
[null,null,null,null,null,null,null,null,null,null,null,null,null,null,null,null,null,null,null,"電源",null,"電源を選択"]
[null,null,null,null,null,null,null,null,null,null,null,null,null,null,null,null,null,null,null,null,null,"流量"]
[null,null,null,null,null,null,null,null,null,3,"口径と材質を選択",null,"搭載機器を選択",null,"流路",null,"有無を選択",null,null,"アラーム\n出力\n(KSLのみ)",null,null,null,null,"AかBを選択"]
[null,null,null,null,null,null,null,null,null,null,null,null,null,null,null,null,null,null,null,null,null,"温度"]
[null,null,null,null,null,null,null,null,null,null,null,null,null,null,"選択",null,null,null,null,null,null,null,null,null,"AかBを選択"]
[]
[]
[null,null,"※使用しないブロック\n　は未記入のままに\n　しておいて下さい。",null,null,null,null,null,null,4,"口径と材質を選択",null,"搭載機器を選択",null,"流路",null,"有無を選択"]
[]
[null,null,null,null,null,null,null,null,null,null,null,null,null,null,"選択"]
[]
[]
[null,null,null,null,null,null,null,null,null,5,"口径と材質を選択",null,"搭載機器を選択",null,"流路",null,"有無を選択"]
[]
[null,null,null,null,null,null,null,null,null,null,null,null,null,null,"選択"]
[]
[]
[null,null,null,null,null,null,null,null,null,6,"口径と材質を選択",null,"搭載機器を選択",null,"流路",null,"有無を選択"]
[]
[null,null,null,null,null,null,null,null,null,null,null,null,null,null,"選択"]
[]
[]
[null,null,null,null,null,null,null,null,null,7,"口径と材質を選択",null,"搭載機器を選択",null,"流路",null,"有無を選択"]
[]
[null,null,null,null,null,null,null,null,null,null,null,null,null,null,"選択"]
[]
[]
[null,null,null,null,null,null,null,null,null,8,"口径と材質を選択",null,"搭載機器を選択",null,"流路",null,"有無を選択"]
[]
[null,null,null,null,null,null,null,null,null,null,null,null,null,null,"選択"]
[]
[]
[null,null,null,null,null,null,null,null,null,9,"口径と材質を選択",null,"搭載機器を選択",null,"流路",null,"有無を選択"]
[]
[null,null,null,null,null,null,null,null,null,null,null,null,null,null,"選択"]
{"$rows_left_out":104}
{"sheet":"部品表","index":1,"n_rows":178,"n_cols":37,"rows_kept":178,"cut":false,"hidden":true,"merged":[[182,18,182,23],[182,24,182,25],[182,26,182,31],[182,32,182,34],[180,18,180,23],[180,24,180,25],[180,26,180,31],[180,32,180,34],[181,18,181,23],[181,24,181,25],[181,26,181,31],[181,32,181,34],[177,32,177,34],[178,18,178,23],[178,24,178,25],[178,26,178,31],[178,32,178,34],[179,18,179,23],[179,24,179,25],[179,26,179,31],[179,32,179,34],[172,25,172,26],[173,25,173,26],[174,25,174,26],[177,18,177,23],[177,24,177,25],[177,26,177,31],[166,25,166,26],[167,25,167,26],[168,25,168,26],[169,25,169,26],[170,25,170,26],[171,25,171,26],[160,25,160,26],[161,25,161,26],[162,25,162,26],[163,25,163,26],[164,25,164,26],[165,25,165,26],[154,25,154,26],[155,25,155,26],[156,25,156,26],[157,25,157,26],[158,25,158,26],[159,25,159,26],[148,25,148,26],[149,25,149,26],[150,25,150,26],[151,25,151,26],[152,25,152,26],[153,25,153,26],[142,25,142,26],[143,25,143,26],[144,25,144,26],[145,25,145,26],[146,25,146,26],[147,25,147,26],[136,25,136,26],[137,25,137,26],[138,25,138,26],[139,25,139,26],[140,25,140,26],[141,25,141,26],[130,25,130,26],[131,25,131,26],[132,25,132,26],[133,25,133,26],[134,25,134,26],[135,25,135,26],[124,25,124,26],[125,25,125,26],[126,25,126,26],[127,25,127,26],[128,25,128,26],[129,25,129,26],[120,31,120,32],[121,18,121,28],[122,18,122,28],[122,29,122,30],[123,18,123,24],[123,25,123,26],[55,2,55,3],[58,2,58,3],[61,2,61,3],[118,27,119,28],[118,31,118,32],[119,31,119,32],[42,2,42,3],[43,2,43,3],[44,2,44,3],[45,2,45,3],[46,2,46,3],[47,2,47,3],[36,2,36,3],[37,2,37,3],[38,2,38,3],[39,2,39,3],[40,2,40,3],[41,2,41,3],[30,2,30,3],[31,2,31,3],[32,2,32,3],[33,2,33,3],[34,2,34,3],[35,2,35,3],[27,2,27,3],[28,2,28,3],[29,2,29,3],[18,2,18,3],[19,2,19,3],[20,2,20,3],[21,2,21,3],[22,2,22,3],[23,2,23,3],[12,2,12,3],[13,2,13,3],[14,2,14,3],[15,2,15,3],[16,2,16,3],[17,2,17,3],[24,2,24,3],[25,2,25,3],[26,2,26,3]]}
[]
[null,"記入欄","：黄色のセルに記入"]
[]
[null,"製品名：","製品名を入力"]
[null,"客先：",{"$f":"SマニR仕様書!G6","v":0}]
[null,"部品番号：","12桁のコードを入力"]
[null,"連数：",{"$f":"SマニR仕様書!G11","v":"連数を選択"}]
[null,"分岐：",{"$f":"COUNTIF(SマニR仕様書!O16:O66,\"×\")","v":0}]
[null,"プラグ：",{"$f":"COUNTIF(SマニR仕様書!O16:O66,\"有\")","v":0}]
[]
[]
[null,null,null,null,null,null,null,null,"品名変換表"]
[null,"連数","部品番号",null,"アダプタ","カウント",null,null,"仕様書→","部品表"]
[null,1,{"$f":"VLOOKUP($E$14,構成部品表!$K$7:$L$8,2,0)","v":"2611-1333-0000"},null,{"$f":"J14","v":"スーパーマニホールド アダプタバルブ"},{"$f":"IF(E14<>\"\",COUNTIF($E$14:$E$23,E14),\"\")","v":1},null,null,{"$f":"SマニR仕様書!Q18","v":"流量調整バルブあり"},{"$f":"IF(I14=\"流量調整バルブあり\",$I$69,IF(I14=\"有無を選択\",\"\",$I$68))","v":"スーパーマニホールド アダプタバルブ"}]
[null,{"$f":"IF($C$7>1,2,\"\")","v":2},{"$f":"IF($C$7>1,VLOOKUP($E$15,構成部品表!$K$7:$L$8,2,0),\"\")","v":{"$error":"#N/A"}},null,"","",null,null,{"$f":"SマニR仕様書!Q23","v":"有無を選択"},""]
[null,{"$f":"IF($C$7>2,3,\"\")","v":3},{"$f":"IF($C$7>2,VLOOKUP($E$16,構成部品表!$K$7:$L$8,2,0),\"\")","v":{"$error":"#N/A"}},null,"","",null,null,{"$f":"SマニR仕様書!Q28","v":"有無を選択"},""]
["アダプタ",{"$f":"IF($C$7>3,4,\"\")","v":4},{"$f":"IF($C$7>3,VLOOKUP($E$17,構成部品表!$K$7:$L$8,2,0),\"\")","v":{"$error":"#N/A"}},null,"","",null,null,{"$f":"SマニR仕様書!Q33","v":"有無を選択"},""]
["選択",{"$f":"IF($C$7>4,5,\"\")","v":5},{"$f":"IF($C$7>4,VLOOKUP($E$18,構成部品表!$K$7:$L$8,2,0),\"\")","v":{"$error":"#N/A"}},null,"","",null,null,{"$f":"SマニR仕様書!Q38","v":"有無を選択"},""]
[null,{"$f":"IF($C$7>5,6,\"\")","v":6},{"$f":"IF($C$7>5,VLOOKUP($E$19,構成部品表!$K$7:$L$8,2,0),\"\")","v":{"$error":"#N/A"}},null,"","",null,null,{"$f":"SマニR仕様書!Q43","v":"有無を選択"},""]
[null,{"$f":"IF($C$7>6,7,\"\")","v":7},{"$f":"IF($C$7>6,VLOOKUP($E$20,構成部品表!$K$7:$L$8,2,0),\"\")","v":{"$error":"#N/A"}},null,"","",null,null,{"$f":"SマニR仕様書!Q48","v":"有無を選択"},""]
[null,{"$f":"IF($C$7>7,8,\"\")","v":8},{"$f":"IF($C$7>7,VLOOKUP($E$21,構成部品表!$K$7:$L$8,2,0),\"\")","v":{"$error":"#N/A"}},null,"","",null,null,{"$f":"SマニR仕様書!Q53","v":"有無を選択"},""]
[null,{"$f":"IF($C$7>8,9,\"\")","v":9},{"$f":"IF($C$7>8,VLOOKUP($E$23,構成部品表!$K$7:$L$8,2,0),\"\")","v":{"$error":"#N/A"}},null,"","",null,null,{"$f":"SマニR仕様書!Q58","v":"有無を選択"},""]
[null,{"$f":"IF($C$7>9,10,\"\")","v":10},{"$f":"IF($C$7>9,VLOOKUP($E$23,構成部品表!$K$7:$L$8,2,0),\"\")","v":{"$error":"#N/A"}},null,"","",null,null,{"$f":"SマニR仕様書!Q63","v":"有無を選択"},""]
[null,"連数","部品番号",null,"接続部","カウント"]
[null,1,{"$f":"VLOOKUP(E25,構成部品表!$O$7:$P$13,2,0)","v":{"$error":"#N/A"}},null,{"$f":"J25","v":""},{"$f":"IF($E25<>\"\",COUNTIF($E$25:$E$34,$E25),\"\")","v":""},null,null,{"$f":"SマニR仕様書!K18","v":"口径と材質を選択"},{"$f":"IF($I25=\"口径と材質を選択\",\"\",VLOOKUP($I25,$I$71:$J$77,2,))","v":""}]
[null,{"$f":"IF($C$7>1,2,\"\")","v":2},{"$f":"IF($C$7>1,VLOOKUP(E26,構成部品表!$O$7:$P$13,2,0),\"\")","v":{"$error":"#N/A"}},null,"","",null,null,{"$f":"SマニR仕様書!K23","v":"口径と材質を選択"},""]
[null,{"$f":"IF($C$7>2,3,\"\")","v":3},{"$f":"IF($C$7>2,VLOOKUP(E27,構成部品表!$O$7:$P$13,2,0),\"\")","v":{"$error":"#N/A"}},null,"","",null,null,{"$f":"SマニR仕様書!K28","v":"口径と材質を選択"},""]
["接続部",{"$f":"IF($C$7>3,4,\"\")","v":4},{"$f":"IF($C$7>3,VLOOKUP(E28,構成部品表!$O$7:$P$13,2,0),\"\")","v":{"$error":"#N/A"}},null,"","",null,null,{"$f":"SマニR仕様書!K33","v":"口径と材質を選択"},""]
["選択",{"$f":"IF($C$7>4,5,\"\")","v":5},{"$f":"IF($C$7>4,VLOOKUP(E29,構成部品表!$O$7:$P$13,2,0),\"\")","v":{"$error":"#N/A"}},null,"","",null,null,{"$f":"SマニR仕様書!K38","v":"口径と材質を選択"},""]
[null,{"$f":"IF($C$7>5,6,\"\")","v":6},{"$f":"IF($C$7>5,VLOOKUP(E30,構成部品表!$O$7:$P$13,2,0),\"\")","v":{"$error":"#N/A"}},null,"","",null,null,{"$f":"SマニR仕様書!K43","v":"口径と材質を選択"},""]
[null,{"$f":"IF($C$7>6,7,\"\")","v":7},{"$f":"IF($C$7>6,VLOOKUP(E31,構成部品表!$O$7:$P$13,2,0),\"\")","v":{"$error":"#N/A"}},null,"","",null,null,{"$f":"SマニR仕様書!K48","v":"口径と材質を選択"},""]
[null,{"$f":"IF($C$7>7,8,\"\")","v":8},{"$f":"IF($C$7>7,VLOOKUP(E32,構成部品表!$O$7:$P$13,2,0),\"\")","v":{"$error":"#N/A"}},null,"","",null,null,{"$f":"SマニR仕様書!K53","v":"口径と材質を選択"},""]
[null,{"$f":"IF($C$7>8,9,\"\")","v":9},{"$f":"IF($C$7>8,VLOOKUP(E33,構成部品表!$O$7:$P$13,2,0),\"\")","v":{"$error":"#N/A"}},null,"","",null,null,{"$f":"SマニR仕様書!K58","v":"口径と材質を選択"},""]
[null,{"$f":"IF($C$7>9,10,\"\")","v":10},{"$f":"IF($C$7>9,VLOOKUP(E34,構成部品表!$O$7:$P$13,2,0),\"\")","v":{"$error":"#N/A"}},null,"","",null,null,{"$f":"SマニR仕様書!K63","v":"口径と材質を選択"},""]
[null,"連数","部品番号",null,"搭載品","カウント"]
[null,1,{"$f":"IF(COUNTIF($J36,\"*KSL*\"),VLOOKUP($K36,構成部品表!$S$47:$T$78,2,),VLOOKUP(E36,構成部品表!$S$7:$T$37,2,0))","v":{"$error":"#N/A"}},null,{"$f":"$J36","v":""},{"$f":"IF($E36<>\"\",COUNTIF($E$36:$E$47,$E36),\"\")","v":""},null,null,{"$f":"SマニR仕様書!M18","v":"搭載機器を選択"},{"$f":"IF($I36=\"搭載機器を選択\",\"\",VLOOKUP($I36,$K$77:$L$107,2,))","v":""},{"$f":"$J36&SマニR仕様書!$Y$28&SマニR仕様書!$Y$30","v":"AかBを選択AかBを選択"}]
[null,{"$f":"IF($C$7>1,2,\"\")","v":2},{"$f":"IF(COUNTIF($J37,\"*KSL*\"),VLOOKUP($K37,構成部品表!$S$47:$T$78,2,),VLOOKUP(E37,構成部品表!$S$7:$T$37,2,0))","v":{"$error":"#N/A"}},null,"","",null,null,{"$f":"SマニR仕様書!M23","v":"搭載機器を選択"},{"$f":"IF($I37=\"搭載機器を選択\",\"\",VLOOKUP($I37,$K$77:$L$107,2,))","v":""},{"$f":"$J37&SマニR仕様書!$Y$28&SマニR仕様書!$Y$30","v":"AかBを選択AかBを選択"}]
[null,{"$f":"IF($C$7>2,3,\"\")","v":3},{"$f":"IF(COUNTIF($J38,\"*KSL*\"),VLOOKUP($K38,構成部品表!$S$47:$T$78,2,),VLOOKUP(E38,構成部品表!$S$7:$T$37,2,0))","v":{"$error":"#N/A"}},null,"","",null,null,{"$f":"SマニR仕様書!M28","v":"搭載機器を選択"},"",{"$f":"$J38&SマニR仕様書!$Y$28&SマニR仕様書!$Y$30","v":"AかBを選択AかBを選択"}]
["搭載品",{"$f":"IF($C$7>3,4,\"\")","v":4},{"$f":"IF(COUNTIF($J39,\"*KSL*\"),VLOOKUP($K39,構成部品表!$S$47:$T$78,2,),VLOOKUP(E39,構成部品表!$S$7:$T$37,2,0))","v":{"$error":"#N/A"}},null,"","",null,null,{"$f":"SマニR仕様書!M33","v":"搭載機器を選択"},"",{"$f":"$J39&SマニR仕様書!$Y$28&SマニR仕様書!$Y$30","v":"AかBを選択AかBを選択"}]
["選択",{"$f":"IF($C$7>4,5,\"\")","v":5},{"$f":"IF(COUNTIF($J40,\"*KSL*\"),VLOOKUP($K40,構成部品表!$S$47:$T$78,2,),VLOOKUP(E40,構成部品表!$S$7:$T$37,2,0))","v":{"$error":"#N/A"}},null,"","",null,null,{"$f":"SマニR仕様書!M38","v":"搭載機器を選択"},"",{"$f":"$J40&SマニR仕様書!$Y$28&SマニR仕様書!$Y$30","v":"AかBを選択AかBを選択"}]
[null,{"$f":"IF($C$7>5,6,\"\")","v":6},{"$f":"IF(COUNTIF($J41,\"*KSL*\"),VLOOKUP($K41,構成部品表!$S$47:$T$78,2,),VLOOKUP(E41,構成部品表!$S$7:$T$37,2,0))","v":{"$error":"#N/A"}},null,"","",null,null,{"$f":"SマニR仕様書!M43","v":"搭載機器を選択"},"",{"$f":"$J41&SマニR仕様書!$Y$28&SマニR仕様書!$Y$30","v":"AかBを選択AかBを選択"}]
[null,{"$f":"IF($C$7>6,7,\"\")","v":7},{"$f":"IF(COUNTIF($J42,\"*KSL*\"),VLOOKUP($K42,構成部品表!$S$47:$T$78,2,),VLOOKUP(E42,構成部品表!$S$7:$T$37,2,0))","v":{"$error":"#N/A"}},null,"","",null,null,{"$f":"SマニR仕様書!M48","v":"搭載機器を選択"},"",{"$f":"$J42&SマニR仕様書!$Y$28&SマニR仕様書!$Y$30","v":"AかBを選択AかBを選択"}]
[null,{"$f":"IF($C$7>7,8,\"\")","v":8},{"$f":"IF(COUNTIF($J43,\"*KSL*\"),VLOOKUP($K43,構成部品表!$S$47:$T$78,2,),VLOOKUP(E43,構成部品表!$S$7:$T$37,2,0))","v":{"$error":"#N/A"}},null,"","",null,null,{"$f":"SマニR仕様書!M53","v":"搭載機器を選択"},"",{"$f":"$J43&SマニR仕様書!$Y$28&SマニR仕様書!$Y$30","v":"AかBを選択AかBを選択"}]
[null,{"$f":"IF($C$7>8,9,\"\")","v":9},{"$f":"IF(COUNTIF($J44,\"*KSL*\"),VLOOKUP($K44,構成部品表!$S$47:$T$78,2,),VLOOKUP(E44,構成部品表!$S$7:$T$37,2,0))","v":{"$error":"#N/A"}},null,"","",null,null,{"$f":"SマニR仕様書!M58","v":"搭載機器を選択"},"",{"$f":"$J44&SマニR仕様書!$Y$28&SマニR仕様書!$Y$30","v":"AかBを選択AかBを選択"}]
[null,{"$f":"IF($C$7>9,10,\"\")","v":10},{"$f":"IF(COUNTIF($J45,\"*KSL*\"),VLOOKUP($K45,構成部品表!$S$47:$T$78,2,),VLOOKUP(E45,構成部品表!$S$7:$T$37,2,0))","v":{"$error":"#N/A"}},null,"","",null,null,{"$f":"SマニR仕様書!M63","v":"搭載機器を選択"},"",{"$f":"$J45&SマニR仕様書!$Y$28&SマニR仕様書!$Y$30","v":"AかBを選択AかBを選択"}]
[null,{"$f":"IF($C$7>10,11,\"\")","v":11},"1311-1624-1200",null,"Oリング　P16　フッ素ゴム",{"$f":"C7*2","v":{"$error":"#VALUE!"}}]
[]
[null,null,null,null,"←部品選択後クリックで部品表自動作成開始"]
[]
[]
[]
[]
[]
[]
[]
[null,null,"部品番号",null,"アダプタ","カウント"]
[null,null,null,null,null,">=1"]
[]
[null,null,"部品番号",null,"搭載品","カウント"]
[null,null,null,null,null,">=1"]
{"$rows_left_out":119}
{"sheet":"構成部品表","index":2,"n_rows":78,"n_cols":28,"rows_kept":78,"cut":false,"hidden":true,"merged":[]}
[]
[]
[]
[]
[null,null,"マニホールド本体","部品番号",null,null,"タイロット","部品番号",null,null,"アダプタ","部品番号",null,null,"接続部","部品番号",null,null,"搭載部品","部品番号",null,"正転仕様","反転仕様",null,null,"連数","部品番号"]
[]
[null,1,"ﾌﾞﾛｯｸ　ｽｰﾊﾟｰM","2611-1301-0000",null,1,"タイロッド1連","2611-1307-0000",null,1,"FSマニホールド アダプタボンネット","2611-1178-0000",null,1,"Rc3/8 BsBM+Niメッキ アダプタ","2211-9904-0000",null,1,"FS-3S","2201-1103-9000",null,"2201-1103-9000","2201-1603-9000",null,1,"1連","2601-1306-0100","1連 スーパーマニホールド サブASSY"]
[null,"2","ﾌﾞﾛｯｸ塗装仕様　ｽｰﾊﾟｰM","2611-1302-0000",null,2,"タイロッド2連","2611-1308-0000",null,2,"スーパーマニホールド アダプタバルブ","2611-1333-0000",null,2,"Rc3/8 SUS アダプタ","2211-9902-0000",null,2,"FS-10S","2201-1110-9000",null,"2201-1110-9000","2201-1610-9000",null,2,"2連","2601-1306-0200","2連 スーパーマニホールド サブASSY"]
[null,"3","ｴﾝﾄﾞﾌﾞﾛｯｸA　ｽｰﾊﾟｰM","2611-1303-0000",null,3,"タイロッド3連","2611-1309-0000",null,null,null,null,null,3,"Rc1/2 BsBM+Niメッキ アダプタ","2211-9908-0000",null,3,"FS-30S","2201-1130-9000",null,"2201-1130-9000","2201-1630-9000",null,3,"3連","2601-1306-0300","3連 スーパーマニホールド サブASSY"]
[null,"4","ｴﾝﾄﾞﾌﾞﾛｯｸB　ｽｰﾊﾟｰM","2611-1304-0000",null,4,"タイロッド4連","2611-1310-0000",null,null,null,null,null,4,"Rc1/2 SUS アダプタ　(標準φ10)","2211-9906-0000",null,4,"FS-3N","2201-1303-9000",null,"2201-1303-9000","2201-1803-9000",null,4,"4連","2601-1306-0400","4連 スーパーマニホールド サブASSY"]
[null,"5","シールリング","2611-1305-0000",null,5,"タイロッド5連","2611-1311-0000",null,null,null,null,null,5,"Rc1/2 SUS アダプタ　(50L用φ12)","2211-9921-0000",null,5,"FS-10N","2201-1310-9000",null,"2201-1310-9000","2201-1810-9000",null,5,"5連","2601-1306-0500","5連 スーパーマニホールド サブASSY"]
[null,"6","シールディスク","2611-1306-0000",null,6,"タイロッド6連","2611-1312-0000",null,null,null,null,null,6,"3/4ニップルアダプタ　(標準φ10)","2211-9920-0000",null,6,"FS-30N","2201-1330-9000",null,"2201-1330-9000","2201-1830-9000",null,6,"6連","2601-1306-0600","6連 スーパーマニホールド サブASSY"]
[null,"7","ﾀｲﾛｯﾄﾞ1連　ｽｰﾊﾟｰM","2611-1307-0000",null,7,"タイロッド7連","2611-1313-0000",null,null,null,null,null,7,"3/4ニップルアダプタ　(50L用φ12)","2211-9965-0000",null,7,"FS-3C","2201-1403-9000",null,"2201-1403-9000","2201-1903-9000",null,7,"7連","2601-1306-0700","7連 スーパーマニホールド サブASSY"]
[null,"8","ﾀｲﾛｯﾄﾞ2連　ｽｰﾊﾟｰM","2611-1308-0000",null,8,"タイロッド8連","2611-1314-0000",null,null,null,null,null,null,null,null,null,8,"FS-10C","2201-1410-9000",null,"2201-1410-9000","2201-1910-9000",null,8,"8連","2601-1306-0800","8連 スーパーマニホールド サブASSY"]
[null,"9","ﾀｲﾛｯﾄﾞ3連　ｽｰﾊﾟｰM","2611-1309-0000",null,9,"タイロッド9連","2611-1315-0000",null,null,null,null,null,null,null,null,null,9,"FS-30C","2201-1430-9000",null,"2201-1430-9000","2201-1930-9000",null,9,"9連","2601-1306-0900","9連 スーパーマニホールド サブASSY"]
[null,"10","ﾀｲﾛｯﾄﾞ4連　ｽｰﾊﾟｰM","2611-1310-0000",null,10,"タイロッド10連","2611-1316-0000",null,null,null,null,null,null,null,null,null,10,"FS-3AR","2201-1203-9000",null,"2201-1203-9000","2201-1703-9000",null,10,"10連","2601-1306-1000","10連 スーパーマニホールド サブASSY"]
[null,"11","ﾀｲﾛｯﾄﾞ5連　ｽｰﾊﾟｰM","2611-1311-0000",null,11,"タイロッド11連","2611-1317-0000",null,null,null,null,null,null,null,null,null,11,"FS-10AR","2201-1210-9000",null,"2201-1210-9000","2201-1710-9000"]
[null,"12","ﾀｲﾛｯﾄﾞ6連　ｽｰﾊﾟｰM","2611-1312-0000",null,12,"タイロッド12連","2611-1318-0000",null,null,null,null,null,null,null,null,null,12,"FS-30AR","2201-1230-9000",null,"2201-1230-9000","2201-1730-9000"]
[null,"13","ﾀｲﾛｯﾄﾞ7連　ｽｰﾊﾟｰM","2611-1313-0000",null,null,null,null,null,null,null,null,null,null,null,null,null,13,"KSL-5L","2301-1*05-9000"]
[null,"14","ﾀｲﾛｯﾄﾞ8連　ｽｰﾊﾟｰM","2611-1314-0000",null,null,null,null,null,null,null,null,null,null,null,null,null,14,"KSL-10L","2301-1*10-9000"]
[null,"15","ﾀｲﾛｯﾄﾞ9連　ｽｰﾊﾟｰM","2611-1315-0000",null,null,null,null,null,null,null,null,null,null,null,null,null,15,"KSL-30L","2301-1*30-9000",null,null,"[カルマン表示付き]"]
[null,"16","ﾀｲﾛｯﾄﾞ10連　ｽｰﾊﾟｰM","2611-1316-0000",null,null,null,null,null,null,null,null,null,null,null,null,null,16,"KSL-50L","2301-1*50-9000",null,"１１：","KSL-アラームAA（正転）"]
[null,"17","ﾀｲﾛｯﾄﾞ11連　ｽｰﾊﾟｰM","2611-1317-0000",null,null,null,null,null,null,null,null,null,null,null,null,null,17,"KSL-5LN","2301-2*05-9000",null,"１２：","KSL-アラームAB（正転）"]
[null,"18","ﾀｲﾛｯﾄﾞ12連　ｽｰﾊﾟｰM","2611-1318-0000",null,null,null,null,null,null,null,null,null,null,null,null,null,18,"KSL-10LN","2301-2*10-9000",null,"１３：","KSL-アラームBA（正転）"]
[null,"19","ｶﾞｲﾄﾞﾊﾞｰ　ｽｰﾊﾟｰM","2611-1319-0000",null,null,null,null,null,null,null,null,null,null,null,null,null,19,"KSL-30LN","2301-2*30-9000",null,"１４：","KSL-アラームBB（正転）"]
[null,"20","Mｼﾞｮｲﾝﾄ　ｽｰﾊﾟｰM","2611-1320-0000",null,null,null,null,null,null,null,null,null,null,null,null,null,20,"KSL-50LN","2301-2*50-9000",null,null,"[カルマン表示無し]"]
[null,"21","ｱﾀﾞﾌﾟﾀﾎﾞﾝﾈｯﾄ　ｽｰﾊﾟｰM SUS","2611-1321-0000",null,null,null,null,null,null,null,null,null,null,null,null,null,21,"スルーパイプSUS","2611-1324-0000",null,"２１：","KSL-NアラームAA（正転）"]
[null,"22","ｱﾀﾞﾌﾟﾀﾊﾞﾙﾌﾞ　ｽｰﾊﾟｰM SUS","2611-1322-0000",null,null,null,null,null,null,null,null,null,null,null,null,null,22,"スルーパイプ BsBM(Niメッキ)","2611-1323-0000",null,"２２：","KSL-NアラームAB（正転）"]
[null,"23","ｽﾙｰﾊﾟｲﾌﾟB　ｽｰﾊﾟｰM","2611-1323-0000",null,null,null,null,null,null,null,null,null,null,null,null,null,23,"マニホールド ストッププラグ SUS","2611-1325-0000",null,"２３：","KSL-NアラームBA（正転）"]
[null,"24","ｽﾙｰﾊﾟｲﾌﾟS　ｽｰﾊﾟｰM","2611-1324-0000",null,null,null,null,null,null,null,null,null,null,null,null,null,24,"マニホールド ストッププラグ BsBM(Niメッキ)","2611-1325-0000",null,"２４：","KSL-NアラームBB（正転）"]
[null,"25","ｽﾄｯﾌﾟﾌﾟﾗｸﾞS　ｽｰﾊﾟｰM","2611-1325-0000",null,null,null,null,null,null,null,null,null,null,null,null,null,25,"マニホールド用 KIボールバルブ組立","2611-1142-0000"]
[null,"26","ﾃﾌﾛﾝｱﾀﾞﾌﾟﾀｰ押さえ　ｽｰﾊﾟｰM","2611-1326-0000",null,null,null,null,null,null,null,null,null,null,null,null,null,26,"VXZ2240マニホールド電磁弁組立","2721-0001-0000"]
[null,"27","ｱﾀﾞﾌﾟﾀｱｰｽ　ｽｰﾊﾟｰM","2611-1327-0000",null,null,null,null,null,null,null,null,null,null,null,null,null,27,"VXZ2242マニホールド電磁弁組立","2721-0002-0000"]
[null,"28","ｱﾀﾞﾌﾟﾀｱｰｽ2　ｽｰﾊﾟｰM","2611-1328-0000",null,null,null,null,null,null,null,null,null,null,null,null,null,28,"RSV NC","2501-2100-9000"]
[null,"29","弁体　ｽｰﾊﾟｰM","2611-1329-0000",null,null,null,null,null,null,null,null,null,null,null,null,null,29,"RSV NO","2501-2200-9000"]
[null,"30","ﾌﾞﾛｯｸ　ｽｰﾊﾟｰM　PPS","2611-1330-0000",null,null,null,null,null,null,null,null,null,null,null,null,null,30,"エアシリンダバルブ総組立図","RA3-1855"]
[null,"31","弁体　ｽｰﾊﾟｰM　ﾒﾀﾙｼｰﾙ","2611-1331-0000",null,null,null,null,null,null,null,null,null,null,null,null,null,31,"マニホールド用トマル/TOM-04M組立","RA4-2740"]
[null,"32","ｽﾄｯﾌﾟﾌﾟﾗｸﾞB　ｽｰﾊﾟｰM","2611-1332-0000"]
[]
[]
[]
[]
[]
[]
[]
[]
[null,null,null,null,null,null,null,null,null,null,null,null,null,null,null,null,null,null,"KSL-5LAA","2301-1605-9000"]
[null,null,null,null,null,null,null,null,null,null,null,null,null,null,null,null,null,null,"KSL-5LAB","2301-1705-9000"]
[null,null,null,null,null,null,null,null,null,null,null,null,null,null,null,null,null,null,"KSL-5LBA","2301-1805-9000"]
[null,null,null,null,null,null,null,null,null,null,null,null,null,null,null,null,null,null,"KSL-5LBB","2301-1905-9000"]
[null,null,null,null,null,null,null,null,null,null,null,null,null,null,null,null,null,null,"KSL-10LAA","2301-1610-9000"]
[null,null,null,null,null,null,null,null,null,null,null,null,null,null,null,null,null,null,"KSL-10LAB","2301-1710-9000"]
[null,null,null,null,null,null,null,null,null,null,null,null,null,null,null,null,null,null,"KSL-10LBA","2301-1810-9000"]
[null,null,null,null,null,null,null,null,null,null,null,null,null,null,null,null,null,null,"KSL-10LBB","2301-1910-9000"]
[null,null,null,null,null,null,null,null,null,null,null,null,null,null,null,null,null,null,"KSL-30LAA","2301-1630-9000"]
[null,null,null,null,null,null,null,null,null,null,null,null,null,null,null,null,null,null,"KSL-30LAB","2301-1730-9000"]
[null,null,null,null,null,null,null,null,null,null,null,null,null,null,null,null,null,null,"KSL-30LBA","2301-1830-9000"]
[null,null,null,null,null,null,null,null,null,null,null,null,null,null,null,null,null,null,"KSL-30LBB","2301-1930-9000"]
[null,null,null,null,null,null,null,null,null,null,null,null,null,null,null,null,null,null,"KSL-50LAA","2301-1650-9000"]
[null,null,null,null,null,null,null,null,null,null,null,null,null,null,null,null,null,null,"KSL-50LAB","2301-1750-9000"]
{"$rows_left_out":18}